{"text_format":"1","workbook":"xlsx","n_sheets":4,"sheets":["Lista","Godišnji","Kvartalni","Mjesecni"],"not_rendered":{"charts":0,"images":0,"macros":1,"external_links":1,"defined_names":13,"comments":3,"pivot_tables":0},"unopened":[],"bounds":{"document_bytes":16777216,"sheet_cells":100000,"rows_first":2000,"rows_last":500,"rows_between":2000,"halvings":0,"cell_chars":16384,"cell_head_chars":4096},"cells_cut":0,"cells_raw":0,"read":"whole","date_system":"1900"}

{"sheet":"Lista","index":0,"n_rows":38,"n_cols":11,"rows_kept":38,"cut":false,"hidden":true,"merged":[]}
[]
[10010001,"SKUPŠTINA ŽUPANIJE POSAVSKE",null,null,null,null,null,null,"1. mjesec","I. kvartal","Siječanj 2016. god."]
[10010002,"STRUČNA SLUŽBA SKUPŠTINE",null,null,null,null,null,null,"2. mjesec","I. kvartal","Veljača 2016. god."]
[11010001,"VLADA ŽUPANIJE POSAVSKE",null,null,null,null,null,null,"3. mjesec","I. kvartal","Ožujak 2016. god."]
[11010002,"URED ZA RASELJENE",null,null,null,null,null,null,"4. mjesec","II. kvartal","Travanj 2016. god."]
[11010003,"URED ZA ZAKONODAVSTVO",null,null,null,null,null,null,"5. mjesec","II. kvartal","Svibanj 2016. god."]
[11010004,"SLUŽBA ZA ODNOSE S JAVNOŠĆU",null,null,null,null,null,null,"6. mjesec","II. kvartal","Lipanj 2016. god."]
[11010005,"URED ZA GOSPODARSKI RAZVOJ ŽP",null,null,null,null,null,null,"7. mjesec","III. kvartal","Srpanj 2016. god."]
[12010001,"ZAJEDNIČKA SLUŽBA VLADE",null,null,null,null,null,null,"8. mjesec","III. kvartal","Kolovoz 2016. god."]
[13010001,"MINISTARSTVO UNUTARNJIH POSLOVA",null,null,null,null,null,null,"9. mjesec","III. kvartal","Rujan 2016. god."]
[14010001,"MINISTARSTVO PRAVOSUĐA I UPRAVE",null,null,null,null,null,null,"10. mjesec","IV. kvartal","Listopad 2016. god."]
[14020003,"OPĆINSKI SUD ORAŠJE",null,null,null,null,null,null,"11. mjesec","IV. kvartal","Studeni 2016. god."]
[14050001,"OPĆINSKO PRAVOBRANITELJSTVO ORAŠJE",null,null,null,null,null,null,"12. mjesec","IV. kvartal","Prosinac 2016. god."]
[14050002,"OPĆINSKO PRAVOBRANITELJSTVO ODŽAK"]
[14060001,"ZAVOD ZA PRUŽANJE PRAVNE POMOĆI"]
[15010001,"MINISTARSTVO GOSPODARSTVA I PROSTORNOG UREĐENJA"]
[16010001,"MINISTARSTVO FINANCIJA"]
[17010001,"MINISTARSTVO ZDRAVSTVA, RADA I SOCIJALNE POLITIKE"]
[18010001,"MINISTARSTVO PROMETA, VEZA, TURIZMA I ZAŠTITE OKOLIŠA"]
[19010001,"MINISTARSTVO POLJOPRIVREDE, VODOPRIVREDE I ŠUMARSTVA"]
[20010001,"MINISTARSTVO PROSVJETE, ZNANOSTI, KULTURE I ŠPORTA"]
[20020002,"SREDNJA ŠKOLA PERE ZEČEVIĆA ODŽAK"]
[20020003,"ŠKOLSKI CENTAR FRA MARTINA NEDIĆA ORAŠJE"]
[20020004,"SREDNJA STRUKOVNA ŠKOLA ORAŠJE"]
[20030001,"OSNOVNA ŠKOLA ORAŠJE"]
[20030002,"OSNOVNA ŠKOLA VLADIMIRA NAZORA ODŽAK"]
[20030003,"OSNOVNA ŠKOLA RUĐERA BOŠKOVIĆA DONJA MAHALA"]
[20030004,"OSNOVNA ŠKOLA FRA ILIJE STARČEVIĆA TOLISA"]
[20030005,"OSNOVNAŠKOLA STJEPANA RADIĆA O.LUKA-BOK"]
[20030006,"OSNOVNA ŠKOLA A.G.MATOŠA VIDOVICE"]
[20030007,"OSNOVNA ŠKOLA BRAĆE RADIĆA DOMALJEVAC"]
[21010001,"MINISTARSTVO BRANITELJA"]
[22010001,"AGENCIJA ZA PRIVATIZACIJU"]
[23010001,"UPRAVA ZA CIVILNU ZAŠTITU"]
[24010001,"KANTONALNI SUD ODŽAK"]
[26010001,"ŽUPANIJSKO PRAVOBRANITELJSTVO"]
[27010001,"KANTONALNO TUŽITELJSTVO"]
[28010001,"ŽUPANIJSKA UPRAVA ZA INSPEKCIJSKE POSLOVE"]

{"sheet":"Godišnji","index":1,"n_rows":928,"n_cols":25,"rows_kept":928,"cut":false,"hidden":false,"merged":[[0,0,0,23],[5,5,8,5],[5,0,8,0],[5,1,8,1],[5,2,8,2],[5,4,8,4],[5,3,8,3]]}
["PRIJEDLOG GODIŠNJEG OPERATIVNOG PLANA RASHODA I IZDATAKA ZA 2016. GODINU"]
[null,null,null,null,null,null,{"$f":"E4","v":18010001}]
["Proračunski korisnik:",null,null,null,{"$f":"INDEX(Lista!A:B,MATCH($E$4,Lista!A:A,0),2)","v":"MINISTARSTVO PROMETA, VEZA, TURIZMA I ZAŠTITE OKOLIŠA"}]
["Organizacijski kod:",null,null,null,18010001]
[]
["Razdjel","Glava","Potroš. jedinica","Funkc. \nklasifikac.","Ekonom. kod","Opis",null,"Proračun za 2016. godinu",null,null,"I. kvartal 2016. god.",null,null,"II. kvartal 2016. god.",null,null,"III. kvartal 2016. god.",null,null,"IV. kvartal 2016. god.",null,null,"Ukupno za 2016. god."]
[null,null,null,null,null,null,"Rashodi i","Rashodi iz","Ukupni ","Rashodi i","Rashodi iz","Ukupni ","Rashodi i","Rashodi iz","Ukupni ","Rashodi i","Rashodi iz","Ukupni ","Rashodi i","Rashodi iz","Ukupni ","Rashodi i","Rashodi iz","Ukupni "]
[null,null,null,null,null,null,"izdaci iz","namj.sr., ","rashodi i","izdaci iz","namj.sr., ","rashodi i","izdaci iz","namj.sr., ","rashodi i","izdaci iz","namj.sr., ","rashodi i","izdaci iz","namj.sr., ","rashodi i","izdaci iz","namj.sr., ","rashodi i"]
[null,null,null,null,null,null,"proračuna","tek. trans. i don.","izdaci","proračuna","tek. trans. i don.","izdaci","proračuna","tek. trans. i don.","izdaci","proračuna","tek. trans. i don.","izdaci","proračuna","tek. trans. i don.","izdaci","proračuna","tek. trans. i don.","izdaci"]
[1,2,3,null,4,5,6,7,8,9,10,11,12,13,14,15,16,17,18,19,20,21,22,23]
[10,"01","0001",null,null,"SKUPŠTINA ŽUPANIJE POSAVSKE"]
[null,null,null,null,611000,"Plaće i naknade troškova zaposlenih",{"$f":"SUM(G13:G15)","v":415800},{"$f":"SUM(H13:H15)","v":0},415800,0,0,0,0,0,0,0,0,0,0,0,0,0,0,0,{"$f":"IF(OR(V12>G12, W12>H12),\"Ukupni operativni plan je veći od Proračuna!\",\"\")","v":""}]
[null,null,null,null,611100,"Bruto plaće i naknade",318500,0,{"$f":"SUM(G13:H13)","v":318500},null,null,{"$f":"SUM(J13:K13)","v":0},null,null,{"$f":"SUM(M13:N13)","v":0},null,null,{"$f":"SUM(P13:Q13)","v":0},null,null,{"$f":"SUM(S13:T13)","v":0},{"$f":"S13+P13+M13+J13","v":0},{"$f":"T13+Q13+N13+K13","v":0},{"$f":"SUM(V13:W13)","v":0},""]
[null,null,null,null,611200,"Naknade troškova zaposlenih",75700,0,{"$f":"SUM(G14:H14)","v":75700},null,null,{"$f":"SUM(J14:K14)","v":0},null,null,{"$f":"SUM(M14:N14)","v":0},null,null,{"$f":"SUM(P14:Q14)","v":0},null,null,{"$f":"SUM(S14:T14)","v":0},{"$f":"S14+P14+M14+J14","v":0},0,{"$f":"SUM(V14:W14)","v":0},""]
[null,null,null,null,611200,"Naknade troškova zaposlenih - volonteri",21600,0,21600,null,null,0,null,null,0,null,null,0,null,null,0,0,0,0,""]
[null,null,null,null,612000,"Doprinosi poslodavca",{"$f":"G17","v":34100},{"$f":"H17","v":0},34100,0,0,0,0,0,0,0,0,0,0,0,0,0,0,0,""]
[null,null,null,null,612100,"Doprinosi poslodavca",34100,0,{"$f":"SUM(G17:H17)","v":34100},null,null,{"$f":"SUM(J17:K17)","v":0},null,null,{"$f":"SUM(M17:N17)","v":0},null,null,{"$f":"SUM(P17:Q17)","v":0},null,null,{"$f":"SUM(S17:T17)","v":0},0,0,{"$f":"SUM(V17:W17)","v":0},""]
[null,null,null,null,613000,"Izdaci za materijal, sitan inventar i usluge",{"$f":"SUM(G19:G28)","v":288840},{"$f":"SUM(H19:H28)","v":0},288840,0,0,0,0,0,0,0,0,0,0,0,0,0,0,0,""]
[null,null,null,null,613100,"Putni troškovi",6000,0,{"$f":"SUM(G19:H19)","v":6000},null,null,{"$f":"SUM(J19:K19)","v":0},null,null,{"$f":"SUM(M19:N19)","v":0},null,null,{"$f":"SUM(P19:Q19)","v":0},null,null,{"$f":"SUM(S19:T19)","v":0},0,0,{"$f":"SUM(V19:W19)","v":0},""]
[null,null,null,null,613200,"Izdaci za energiju",13600,0,13600,null,null,0,null,null,0,null,null,0,null,null,0,0,0,0,""]
[null,null,null,null,613300,"Izdaci za komunikaciju i komunalne usluge",7300,0,7300,null,null,0,null,null,0,null,null,0,null,null,0,0,0,0,""]
[null,null,null,null,613400,"Nabava materijala i sitnog inventara",5500,0,5500,null,null,0,null,null,0,null,null,0,null,null,0,0,0,0,""]
[null,null,null,null,613500,"Izdaci za usluge prijevoza i goriva",10000,0,10000,null,null,0,null,null,0,null,null,0,null,null,0,0,0,0,""]
[null,null,null,null,613600,"Unajmljivanje imovine, opreme i nemat.imovine",0,0,0,null,null,0,null,null,0,null,null,0,null,null,0,0,0,0,""]
[null,null,null,null,613700,"Izdaci za tekuće održavanje",8000,0,8000,null,null,0,null,null,0,null,null,0,null,null,0,0,0,0,""]
[null,null,null,null,613800,"Izdaci osiguranja, bank.usluga i usluga PP",340,0,340,null,null,0,null,null,0,null,null,0,null,null,0,0,0,0,""]
[null,null,null,null,613900,"Ugovorene i druge posebne usluge",215400,0,215400,null,null,0,null,null,0,null,null,0,null,null,0,0,0,0,""]
[null,null,null,null,613900,"Ugovorene i druge posebne usluge - volonteri",22700,0,22700,null,null,0,null,null,0,null,null,0,null,null,0,0,0,0,""]
[null,null,null,null,821000,"Izdaci za nabavku stalnih sredstava",{"$f":"SUM(G30:G31)","v":4000},{"$f":"SUM(H30:H31)","v":0},4000,0,0,0,0,0,0,0,0,0,0,0,0,0,0,0,""]
[null,null,null,null,821200,"Nabavka građevina",2000,0,{"$f":"SUM(G30:H30)","v":2000},null,null,{"$f":"SUM(J30:K30)","v":0},null,null,{"$f":"SUM(M30:N30)","v":0},null,null,{"$f":"SUM(P30:Q30)","v":0},null,null,{"$f":"SUM(S30:T30)","v":0},0,0,{"$f":"SUM(V30:W30)","v":0},""]
[null,null,null,null,821300,"Nabavka opreme",2000,0,{"$f":"SUM(G31:H31)","v":2000},null,null,{"$f":"SUM(J31:K31)","v":0},null,null,{"$f":"SUM(M31:N31)","v":0},null,null,{"$f":"SUM(P31:Q31)","v":0},null,null,{"$f":"SUM(S31:T31)","v":0},0,0,{"$f":"SUM(V31:W31)","v":0},""]
[null,null,null,null,null,"Ukupno za korisnika Skupština Županije Posavske",{"$f":"G12+G16+G18+G29","v":742740},{"$f":"H12+H16+H18+H29","v":0},742740,0,0,0,0,0,0,0,0,0,0,0,0,0,0,0,""]
[]
[10,"01","0002",null,null,"STRUČNA SLUŽBA SKUPŠTINE"]
[null,null,null,null,611000,"Plaće i naknade troškova zaposlenih",{"$f":"SUM(G36:G38)","v":40820},{"$f":"SUM(H36:H38)","v":0},{"$f":"SUM(I36:I38)","v":40820},{"$f":"SUM(J36:J38)","v":0},{"$f":"SUM(K36:K38)","v":0},{"$f":"SUM(L36:L38)","v":0},{"$f":"SUM(M36:M38)","v":16825},{"$f":"SUM(N36:N38)","v":0},{"$f":"SUM(O36:O38)","v":16825},{"$f":"SUM(P36:P38)","v":0},{"$f":"SUM(Q36:Q38)","v":0},{"$f":"SUM(R36:R38)","v":0},{"$f":"SUM(S36:S38)","v":0},{"$f":"SUM(T36:T38)","v":0},{"$f":"SUM(U36:U38)","v":0},{"$f":"SUM(V36:V38)","v":16825},{"$f":"SUM(W36:W38)","v":0},{"$f":"SUM(X36:X38)","v":16825},{"$f":"IF(OR(V35>G35, W35>H35),\"Ukupni operativni plan je veći od Proračuna!\",\"\")","v":""}]
[null,null,null,null,611100,"Bruto plaće i naknade",30500,0,{"$f":"SUM(G36:H36)","v":30500},null,null,{"$f":"SUM(J36:K36)","v":0},13250,0,{"$f":"SUM(M36:N36)","v":13250},null,null,{"$f":"SUM(P36:Q36)","v":0},null,null,{"$f":"SUM(S36:T36)","v":0},{"$f":"S36+P36+M36+J36","v":13250},{"$f":"T36+Q36+N36+K36","v":0},{"$f":"SUM(V36:W36)","v":13250},""]
[null,null,null,null,611200,"Naknade troškova zaposlenih",10320,0,{"$f":"SUM(G37:H37)","v":10320},null,null,{"$f":"SUM(J37:K37)","v":0},3575,0,{"$f":"SUM(M37:N37)","v":3575},null,null,{"$f":"SUM(P37:Q37)","v":0},null,null,{"$f":"SUM(S37:T37)","v":0},{"$f":"S37+P37+M37+J37","v":3575},0,{"$f":"SUM(V37:W37)","v":3575},""]
[null,null,null,null,611200,"Naknade troškova zaposlenih - volonteri",0,0,0,null,null,0,0,0,0,null,null,0,null,null,0,0,0,0,""]
[null,null,null,null,612000,"Doprinosi poslodavca",{"$f":"G40","v":3400},{"$f":"H40","v":0},{"$f":"I40","v":3400},{"$f":"J40","v":0},{"$f":"K40","v":0},{"$f":"L40","v":0},{"$f":"M40","v":1430},{"$f":"N40","v":0},{"$f":"O40","v":1430},{"$f":"P40","v":0},{"$f":"Q40","v":0},{"$f":"R40","v":0},{"$f":"S40","v":0},{"$f":"T40","v":0},{"$f":"U40","v":0},{"$f":"V40","v":1430},{"$f":"W40","v":0},{"$f":"X40","v":1430},""]
[null,null,null,null,612100,"Doprinosi poslodavca",3400,0,{"$f":"SUM(G40:H40)","v":3400},null,null,{"$f":"SUM(J40:K40)","v":0},1430,0,{"$f":"SUM(M40:N40)","v":1430},null,null,{"$f":"SUM(P40:Q40)","v":0},null,null,{"$f":"SUM(S40:T40)","v":0},{"$f":"S40+P40+M40+J40","v":1430},{"$f":"T40+Q40+N40+K40","v":0},{"$f":"SUM(V40:W40)","v":1430},""]
{"$rows_left_out":889}
{"sheet":"Kvartalni","index":2,"n_rows":929,"n_cols":21,"rows_kept":929,"cut":false,"hidden":false,"merged":[[0,0,0,20],[6,0,9,0],[6,1,9,1],[6,2,9,2],[6,4,9,4],[6,5,9,5]]}
[{"$f":"\"PRIJEDLOG TROMJESEČNOG OPERATIVNOG PLANA RASHODA I IZDATAKA ZA \"&E5&\" 2016. GODINE\"","v":"PRIJEDLOG TROMJESEČNOG OPERATIVNOG PLANA RASHODA I IZDATAKA ZA IV. kvartal 2016. GODINE"}]
[null,null,null,null,null,null,{"$f":"E4","v":11010001}]
["Proračunski korisnik:",null,null,null,{"$f":"INDEX(Lista!A:B,MATCH($E$4,Lista!A:A,0),2)","v":"VLADA ŽUPANIJE POSAVSKE"}]
["Organizacijski kod:",null,null,null,11010001]
["Kvartal:",null,null,null,"IV. kvartal"]
[]
["Razdjel","Glava","Potroš. jedinica",null,"Ekonom. kod","Opis",null,"Proračun za 2016. godinu",null,null,{"$f":"INDEX(Lista!J:K,MATCH($E$5,Lista!J:J,0),2)","v":"Listopad 2016. god."},null,null,{"$f":"INDEX(Lista!J:K,MATCH($E$5,Lista!J:J,0)+1,2)","v":"Studeni 2016. god."},null,null,{"$f":"INDEX(Lista!J:K,MATCH($E$5,Lista!J:J,0)+2,2)","v":"Prosinac 2016. god."},null,null,{"$f":"\"Ukupno za \"&E5&\" 2016. god.\"","v":"Ukupno za IV. kvartal 2016. god."}]
[null,null,null,null,null,null,"Rashodi i","Rashodi iz","Ukupni ","Rashodi i","Rashodi iz","Ukupni ","Rashodi i","Rashodi iz","Ukupni ","Rashodi i","Rashodi iz","Ukupni ","Rashodi i","Rashodi iz","Ukupni "]
[null,null,null,null,null,null,"izdaci iz","namj.sr., ","rashodi i","izdaci iz","namj.sr., ","rashodi i","izdaci iz","namj.sr., ","rashodi i","izdaci iz","namj.sr., ","rashodi i","izdaci iz","namj.sr., ","rashodi i"]
[null,null,null,null,null,null,"proračuna","tek. trans. i don.","izdaci","proračuna","tek. trans. i don.","izdaci","proračuna","tek. trans. i don.","izdaci","proračuna","tek. trans. i don.","izdaci","proračuna","tek. trans. i don.","izdaci"]
[1,2,3,null,4,5,6,7,8,9,10,11,12,13,14,15,16,17,18,19,20]
[10,"01","0001",null,null,"SKUPŠTINA ŽUPANIJE POSAVSKE"]
[null,null,null,null,611000,"Plaće i naknade troškova zaposlenih",{"$f":"SUM(G14:G16)","v":415800},{"$f":"SUM(H14:H16)","v":0},415800,0,0,0,0,0,0,0,0,0,0,0,0]
[null,null,null,null,611100,"Bruto plaće i naknade",{"$f":"Godišnji!G13","v":318500},0,{"$f":"SUM(G14:H14)","v":318500},null,null,{"$f":"SUM(J14:K14)","v":0},null,null,{"$f":"SUM(M14:N14)","v":0},null,null,{"$f":"SUM(P14:Q14)","v":0},{"$f":"P14+M14+J14","v":0},{"$f":"Q14+N14+K14","v":0},{"$f":"SUM(S14:T14)","v":0}]
[null,null,null,null,611200,"Naknade troškova zaposlenih",{"$f":"Godišnji!G14","v":75700},0,{"$f":"SUM(G15:H15)","v":75700},null,null,{"$f":"SUM(J15:K15)","v":0},null,null,{"$f":"SUM(M15:N15)","v":0},null,null,{"$f":"SUM(P15:Q15)","v":0},{"$f":"P15+M15+J15","v":0},{"$f":"Q15+N15+K15","v":0},{"$f":"SUM(S15:T15)","v":0}]
[null,null,null,null,611200,"Naknade troškova zaposlenih - volonteri",{"$f":"Godišnji!G15","v":21600},0,21600,null,null,0,null,null,0,null,null,0,0,0,0]
[null,null,null,null,612000,"Doprinosi poslodavca",{"$f":"G18","v":34100},{"$f":"H18","v":0},34100,0,0,0,0,0,0,0,0,0,0,0,0]
[null,null,null,null,612100,"Doprinosi poslodavca",{"$f":"Godišnji!G17","v":34100},0,{"$f":"SUM(G18:H18)","v":34100},null,null,{"$f":"SUM(J18:K18)","v":0},null,null,{"$f":"SUM(M18:N18)","v":0},null,null,{"$f":"SUM(P18:Q18)","v":0},{"$f":"P18+M18+J18","v":0},{"$f":"Q18+N18+K18","v":0},{"$f":"SUM(S18:T18)","v":0}]
[null,null,null,null,613000,"Izdaci za materijal, sitan inventar i usluge",{"$f":"SUM(G20:G29)","v":288840},{"$f":"SUM(H20:H29)","v":0},288840,0,0,0,0,0,0,0,0,0,0,0,0]
[null,null,null,null,613100,"Putni troškovi",{"$f":"Godišnji!G19","v":6000},0,{"$f":"SUM(G20:H20)","v":6000},null,null,{"$f":"SUM(J20:K20)","v":0},null,null,{"$f":"SUM(M20:N20)","v":0},null,null,{"$f":"SUM(P20:Q20)","v":0},{"$f":"P20+M20+J20","v":0},{"$f":"Q20+N20+K20","v":0},{"$f":"SUM(S20:T20)","v":0}]
[null,null,null,null,613200,"Izdaci za energiju",{"$f":"Godišnji!G20","v":13600},0,13600,null,null,0,null,null,0,null,null,0,0,0,0]
[null,null,null,null,613300,"Izdaci za komunikaciju i komunalne usluge",{"$f":"Godišnji!G21","v":7300},0,7300,null,null,0,null,null,0,null,null,0,0,0,0]
[null,null,null,null,613400,"Nabava materijala i sitnog inventara",{"$f":"Godišnji!G22","v":5500},0,5500,null,null,0,null,null,0,null,null,0,0,0,0]
[null,null,null,null,613500,"Izdaci za usluge prijevoza i goriva",{"$f":"Godišnji!G23","v":10000},0,10000,null,null,0,null,null,0,null,null,0,0,0,0]
[null,null,null,null,613600,"Unajmljivanje imovine, opreme i nemat.imovine",{"$f":"Godišnji!G24","v":0},0,0,null,null,0,null,null,0,null,null,0,0,0,0]
[null,null,null,null,613700,"Izdaci za tekuće održavanje",{"$f":"Godišnji!G25","v":8000},0,8000,null,null,0,null,null,0,null,null,0,0,0,0]
[null,null,null,null,613800,"Izdaci osiguranja, bank.usluga i usluga PP",{"$f":"Godišnji!G26","v":340},0,340,null,null,0,null,null,0,null,null,0,0,0,0]
[null,null,null,null,613900,"Ugovorene i druge posebne usluge",{"$f":"Godišnji!G27","v":215400},0,215400,null,null,0,null,null,0,null,null,0,0,0,0]
[null,null,null,null,613900,"Ugovorene i druge posebne usluge - volonteri",{"$f":"Godišnji!G28","v":22700},0,22700,null,null,0,null,null,0,null,null,0,0,0,0]
[null,null,null,null,821000,"Izdaci za nabavku stalnih sredstava",{"$f":"SUM(G31:G32)","v":4000},{"$f":"SUM(H31:H32)","v":0},4000,0,0,0,0,0,0,0,0,0,0,0,0]
[null,null,null,null,821200,"Nabavka građevina",{"$f":"Godišnji!G30","v":2000},0,{"$f":"SUM(G31:H31)","v":2000},null,null,{"$f":"SUM(J31:K31)","v":0},null,null,{"$f":"SUM(M31:N31)","v":0},null,null,{"$f":"SUM(P31:Q31)","v":0},{"$f":"P31+M31+J31","v":0},{"$f":"Q31+N31+K31","v":0},{"$f":"SUM(S31:T31)","v":0}]
[null,null,null,null,821300,"Nabavka opreme",{"$f":"Godišnji!G31","v":2000},0,{"$f":"SUM(G32:H32)","v":2000},null,null,{"$f":"SUM(J32:K32)","v":0},null,null,{"$f":"SUM(M32:N32)","v":0},null,null,{"$f":"SUM(P32:Q32)","v":0},0,0,{"$f":"SUM(S32:T32)","v":0}]
[null,null,null,null,null,"Ukupno za korisnika Skupština Županije Posavske",{"$f":"G13+G17+G19+G30","v":742740},{"$f":"H13+H17+H19+H30","v":0},742740,0,0,0,0,0,0,0,0,0,0,0,0]
[]
[10,"01","0002",null,null,"STRUČNA SLUŽBA SKUPŠTINE"]
[null,null,null,null,611000,"Plaće i naknade troškova zaposlenih",{"$f":"SUM(G37:G39)","v":40820},{"$f":"SUM(H37:H39)","v":0},40820,0,0,0,0,0,0,0,0,0,0,0,0]
[null,null,null,null,611100,"Bruto plaće i naknade",{"$f":"Godišnji!G36","v":30500},0,{"$f":"SUM(G37:H37)","v":30500},null,null,{"$f":"SUM(J37:K37)","v":0},null,null,{"$f":"SUM(M37:N37)","v":0},null,null,{"$f":"SUM(P37:Q37)","v":0},{"$f":"P37+M37+J37","v":0},{"$f":"Q37+N37+K37","v":0},{"$f":"SUM(S37:T37)","v":0}]
[null,null,null,null,611200,"Naknade troškova zaposlenih",{"$f":"Godišnji!G37","v":10320},0,{"$f":"SUM(G38:H38)","v":10320},null,null,{"$f":"SUM(J38:K38)","v":0},null,null,{"$f":"SUM(M38:N38)","v":0},null,null,{"$f":"SUM(P38:Q38)","v":0},{"$f":"P38+M38+J38","v":0},{"$f":"Q38+N38+K38","v":0},{"$f":"SUM(S38:T38)","v":0}]
[null,null,null,null,611200,"Naknade troškova zaposlenih - volonteri",{"$f":"Godišnji!G38","v":0},0,0,null,null,0,null,null,0,null,null,0,0,0,0]
[null,null,null,null,612000,"Doprinosi poslodavca",{"$f":"Godišnji!G39","v":3400},{"$f":"H41","v":0},3400,0,0,0,0,0,0,0,0,0,0,0,0]
{"$rows_left_out":890}
{"sheet":"Mjesecni","index":3,"n_rows":929,"n_cols":12,"rows_kept":929,"cut":false,"hidden":false,"merged":[[6,0,9,0],[6,1,9,1],[6,2,9,2],[6,4,9,4],[6,5,9,5]]}
[null,null,null,null,null,{"$f":"\"PRIJEDLOG MJESEČNOG OPERATIVNOG PLANA RASHODA I IZDATAKA ZA \"&E5&\" 2016. GODINE\"","v":"PRIJEDLOG MJESEČNOG OPERATIVNOG PLANA RASHODA I IZDATAKA ZA 10. mjesec 2016. GODINE"}]
[null,null,null,null,null,null,{"$f":"E4","v":11010001}]
["Proračunski korisnik:",null,null,null,{"$f":"INDEX(Lista!A:B,MATCH($E$4,Lista!A:A,0),2)","v":"VLADA ŽUPANIJE POSAVSKE"}]
["Organizacijski kod:",null,null,null,11010001]
["Mjesec:",null,null,null,"10. mjesec"]
[]
["Razdjel","Glava","Potroš. jedinica",null,"Ekonom. kod","Opis",null,"Proračun za 2016. godinu",null,null,{"$f":"INDEX(Lista!I:K,MATCH($E$5,Lista!I:I,0),3)","v":"Listopad 2016. god."}]
[null,null,null,null,null,null,"Rashodi i","Rashodi iz","Ukupni ","Rashodi i","Rashodi iz","Ukupni "]
[null,null,null,null,null,null,"izdaci iz","namj.sr., ","rashodi i","izdaci iz","namj.sr., ","rashodi i"]
[null,null,null,null,null,null,"proračuna","tek. trans. i don.","izdaci","proračuna","tek. trans. i don.","izdaci"]
[1,2,3,null,4,5,6,7,8,9,10,11]
[10,"01","0001",null,null,"SKUPŠTINA ŽUPANIJE POSAVSKE"]
[null,null,null,null,611000,"Plaće i naknade troškova zaposlenih",{"$f":"SUM(G14:G16)","v":415800},{"$f":"SUM(H14:H16)","v":0},415800,0,0,0]
[null,null,null,null,611100,"Bruto plaće i naknade",{"$f":"Godišnji!G13","v":318500},{"$f":"Godišnji!H13","v":0},{"$f":"SUM(G14:H14)","v":318500},null,null,{"$f":"SUM(J14:K14)","v":0}]
[null,null,null,null,611200,"Naknade troškova zaposlenih",{"$f":"Godišnji!G14","v":75700},{"$f":"Godišnji!H14","v":0},{"$f":"SUM(G15:H15)","v":75700},null,null,{"$f":"SUM(J15:K15)","v":0}]
[null,null,null,null,611200,"Naknade troškova zaposlenih - volonteri",{"$f":"Godišnji!G15","v":21600},{"$f":"Godišnji!H15","v":0},21600,null,null,0]
[null,null,null,null,612000,"Doprinosi poslodavca",{"$f":"G18","v":34100},{"$f":"H18","v":0},34100,0,0,0]
[null,null,null,null,612100,"Doprinosi poslodavca",{"$f":"Godišnji!G17","v":34100},{"$f":"Godišnji!H17","v":0},{"$f":"SUM(G18:H18)","v":34100},null,null,{"$f":"SUM(J18:K18)","v":0}]
[null,null,null,null,613000,"Izdaci za materijal, sitan inventar i usluge",{"$f":"SUM(G20:G29)","v":288840},{"$f":"SUM(H20:H29)","v":0},288840,0,0,0]
[null,null,null,null,613100,"Putni troškovi",{"$f":"Godišnji!G19","v":6000},{"$f":"Godišnji!H19","v":0},{"$f":"SUM(G20:H20)","v":6000},null,null,{"$f":"SUM(J20:K20)","v":0}]
[null,null,null,null,613200,"Izdaci za energiju",{"$f":"Godišnji!G20","v":13600},{"$f":"Godišnji!H20","v":0},13600,null,null,0]
[null,null,null,null,613300,"Izdaci za komunikaciju i komunalne usluge",{"$f":"Godišnji!G21","v":7300},{"$f":"Godišnji!H21","v":0},7300,null,null,0]
[null,null,null,null,613400,"Nabava materijala i sitnog inventara",{"$f":"Godišnji!G22","v":5500},{"$f":"Godišnji!H22","v":0},5500,null,null,0]
[null,null,null,null,613500,"Izdaci za usluge prijevoza i goriva",{"$f":"Godišnji!G23","v":10000},{"$f":"Godišnji!H23","v":0},10000,null,null,0]
[null,null,null,null,613600,"Unajmljivanje imovine, opreme i nemat.imovine",{"$f":"Godišnji!G24","v":0},{"$f":"Godišnji!H24","v":0},0,null,null,0]
[null,null,null,null,613700,"Izdaci za tekuće održavanje",{"$f":"Godišnji!G25","v":8000},{"$f":"Godišnji!H25","v":0},8000,null,null,0]
[null,null,null,null,613800,"Izdaci osiguranja, bank.usluga i usluga PP",{"$f":"Godišnji!G26","v":340},{"$f":"Godišnji!H26","v":0},340,null,null,0]
[null,null,null,null,613900,"Ugovorene i druge posebne usluge",{"$f":"Godišnji!G27","v":215400},{"$f":"Godišnji!H27","v":0},215400,null,null,0]
[null,null,null,null,613900,"Ugovorene i druge posebne usluge - volonteri",{"$f":"Godišnji!G28","v":22700},{"$f":"Godišnji!H28","v":0},22700,null,null,0]
[null,null,null,null,821000,"Izdaci za nabavku stalnih sredstava",{"$f":"SUM(G31:G32)","v":4000},{"$f":"SUM(H31:H32)","v":0},4000,0,0,0]
[null,null,null,null,821200,"Nabavka građevina",{"$f":"Godišnji!G30","v":2000},{"$f":"Godišnji!H30","v":0},{"$f":"SUM(G31:H31)","v":2000},null,null,{"$f":"SUM(J31:K31)","v":0}]
[null,null,null,null,821300,"Nabavka opreme",{"$f":"Godišnji!G31","v":2000},{"$f":"Godišnji!H31","v":0},{"$f":"SUM(G32:H32)","v":2000},null,null,{"$f":"SUM(J32:K32)","v":0}]
[null,null,null,null,null,"Ukupno za korisnika Skupština Županije Posavske",{"$f":"G13+G17+G19+G30","v":742740},{"$f":"H13+H17+H19+H30","v":0},742740,0,0,0]
[]
[10,"01","0002",null,null,"STRUČNA SLUŽBA SKUPŠTINE"]
[null,null,null,null,611000,"Plaće i naknade troškova zaposlenih",{"$f":"SUM(G37:G39)","v":40820},{"$f":"SUM(H37:H39)","v":0},40820,0,0,0]
[null,null,null,null,611100,"Bruto plaće i naknade",{"$f":"Godišnji!G36","v":30500},{"$f":"Godišnji!H36","v":0},{"$f":"SUM(G37:H37)","v":30500},null,null,{"$f":"SUM(J37:K37)","v":0}]
[null,null,null,null,611200,"Naknade troškova zaposlenih",{"$f":"Godišnji!G37","v":10320},{"$f":"Godišnji!H37","v":0},{"$f":"SUM(G38:H38)","v":10320},null,null,{"$f":"SUM(J38:K38)","v":0}]
[null,null,null,null,611200,"Naknade troškova zaposlenih - volonteri",{"$f":"Godišnji!G38","v":0},{"$f":"Godišnji!H38","v":0},0,null,null,0]
[null,null,null,null,612000,"Doprinosi poslodavca",{"$f":"G41","v":3400},{"$f":"H41","v":0},3400,0,0,0]
{"$rows_left_out":889}